skyseb

Members
  • Content count

    17
  • Joined

  • Last visited

Community Reputation

0 Neutral

About skyseb

  • Rank
    Member

Profile Information

  • Gender
    Male
  1. hello jack , i have the same problem , when i download your porgramm and launch it, i have the same error message that "kb1gtt" i thinks that in your zip , there is not all files ;( thanks
  2. skyseb

    LCD problem

    i have changed the files, but there are always this problem
  3. skyseb

    Library EEPROM

    thanks for your idea, but this not my problem , my problem is to write in the flash. i use command about SPI-Flash but there is a problem, because when i read status register , it is at 0, whereas it would have to 2 to write in the flash. have it any lock in the papilio pro to write in the flash ? thanks
  4. skyseb

    LCD problem

    yes the point seems crash the arduino programm, because when i define a float, the program about the arduino crash and the lcd print "0.".
  5. skyseb

    Library EEPROM

    in fact, i want send data in the flash. i have to use SPIDATA and SPICTL about ZPUINO in my Arduino ?
  6. skyseb

    Library EEPROM

    okay, thanks, because i want save my data in the spi flash about Papilio Pro cards
  7. skyseb

    LCD problem

    okay thanks alvie
  8. skyseb

    Library EEPROM

    Hey, on Arduino 102 the library EEPROM doesn't function . when i import the library and compil i have this error: EEPROM.cpp:24:24: avr/eeprom.h: No such file or directoryEEPROM.cpp: In member function `uint8_t EEPROMClass::read(int)':EEPROM.cpp:42: error: `eeprom_read_byte' undeclared (first use this function)EEPROM.cpp:42: error: (Each undeclared identifier is reported only once for each function it appears in.)EEPROM.cpp: In member function `void EEPROMClass::write(int, uint8_t)':EEPROM.cpp:47: error: `eeprom_write_byte' undeclared (first use this function)make[1]: *** [EEPROM.o] Error 1make: *** [EEPROM\libEEPROM.a] Error 2C:\arduino-0102\hardware\tools\zpu\bin\make a retourné 2 have you any idea about this problem?thanks skyseb
  9. skyseb

    LCD problem

    for example when i write: float Val; lcd.print(Val); the program doesn't launch and the lcd stay frozen at "0."
  10. skyseb

    LCD problem

    hello, i have a problem with the IDE arduino, because, i can't print a float on the LCD. i use Arduino -102, for ZPUINO. when i want to print a float in the lcd, the value stay frozen at "0. ". have you any idea about this problem? thanks
  11. skyseb

    Problem Arduino ZPuino

    thanks you Alvie
  12. skyseb

    Problem Arduino ZPuino

    hello , i download the last version about arduino for zpuino and papilio pro, but when i run a program for example (void setup(){} void loop(){} just there) i have this message error: C:/arduino-0102/hardware/zpuino/cores/zpuino/register.h: Assembler messages:C:/arduino-0102/hardware/zpuino/cores/zpuino/register.h:23: Error: illegal instructionmake[1]: *** [zpuino-accel.o] Error 1make: *** [core\libcore.a] Error 2C:\arduino-0102\hardware\tools\zpu\bin\make a retourné 2 i don't understand why i have this error. thanks to help me skyseb
  13. Hello, In the AVR 8 project (download in the site papilio) i have changed the fpga properties ( because i have a spartan 6 and not a spartan 3) et i have changed the Paplio one.ucf with the Papilio_pro.ucf. Now when i click on the DCM i have a error cloxking Wizard, so my idea has been created a new DCM to spartan 6. i add a new source and my fpga doens't appear in the window. So i don't understand why the spartan 6 doens't appear ? skyseb
  14. skyseb

    Problem With ISE

    i had to rename the file "Perl "in window in an other name. thanks
  15. skyseb

    Problem With ISE

    Hello, I have a problem with ISE- Xilinx, when i start "Generation Programming File" , ISE print this error message: "Started : "Map". Running map... Command Line: map -intstyle ise -p xc3s500e-vq100-4 -cm area -ir off -pr off -c 100 -o Papilio_AVR8_map.ncd Papilio_AVR8.ngd Papilio_AVR8.pcf Can't open perl script "f:\Perl\bin\map": No such file or directory Process "Map" failed" have you any idea about this error? Thanks.